Target
Progesterone receptor
Ligand
BDBM50228080
Substrate
Meas. Tech.
ChEMBL_452395 (CHEMBL902631)
Ki
399.7±n/a nM
Citation
 Bell, MGGernert, DLGrese, TABelvo, MDBorromeo, PSKelley, SAKennedy, JHKolis, SPLander, PARichey, RSharp, VSStephenson, GAWilliams, JDYu, HZimmerman, KMSteinberg, MIJadhav, PK (S)-N-{3-[1-cyclopropyl-1-(2,4-difluoro-phenyl)-ethyl]-1H-indol-7-yl}-methanesulfonamide: a potent, nonsteroidal, functional antagonist of the mineralocorticoid receptor. J Med Chem 50:6443-5 (2007)  
Target
Name:
Progesterone receptor
Synonyms:
NR3C3 PGR PRGR_HUMAN | progesterone
Type:
Protein
Mol. Mass.:
98979.52
Organism:
Homo sapiens (Human)
Description:
P06401
Residue:
933
  
Inhibitor
Name:
BDBM50228080
Synonyms:
2',15'-dimethyl-5,5'-dioxo-(9'R)-spiro[tetrahydrofuran-2,14'-tetracyclo[8.7.0.02,7.011,15]heptadec-6'-ene]-9-yl ethanethioate 2',15'-dimethyl-5,5'-dioxospiro[tetrahydrofuran-2,14'-tetracyclo[8.7.0.02,7.011,15]heptadec-6'-ene]-9-yl ethanethioate(Spiranolactone) CHEMBL1393 SPIRONOLACTONE cid_5833
Type:
Small organic molecule
Emp. Form.:
C24H32O4S
Mol. Mass.:
416.573
SMILES:
CC(=O)S[C@@H]1CC2=CC(=O)CC[C@]2(C)[C@H]2CC[C@@]3(C)[C@@H](CC[C@@]33CCC(=O)O3)[C@H]12
: