Target
Myosin light chain kinase, smooth muscle
Ligand
BDBM15236
Substrate
Meas. Tech.
ChEMBL_526707 (CHEMBL971891)
Ki
1700±n/a nM
Citation
 McArdle, BMCampitelli, MRQuinn, RJ A common protein fold topology shared by flavonoid biosynthetic enzymes and therapeutic targets. J Nat Prod 69:14-7 (2006)  
Target
Name:
Myosin light chain kinase, smooth muscle
Synonyms:
KRP MLCK MYLK MYLK_HUMAN Telokin | smMLCK
Type:
Protein
Mol. Mass.:
210702.56
Organism:
Homo sapiens (Human)
Description:
Q15746
Residue:
1914
  
Inhibitor
Name:
BDBM15236
Synonyms:
3,5,7-trihydroxy-2-(3,4,5-trihydroxyphenyl)-4H-chromen-4-one CHEMBL164 Myricetin Myricetin (Myr) | cid_5281672
Type:
Small organic molecule
Emp. Form.:
C15H10O8
Mol. Mass.:
318.2351
SMILES:
Oc1cc(O)c2c(c1)oc(-c1cc(O)c(O)c(O)c1)c(O)c2=O
: