Target
11-beta-hydroxysteroid dehydrogenase 1
Ligand
BDBM50260880
Substrate
Meas. Tech.
ChEMBL_552255 (CHEMBL995585)
IC50
1.4±n/a nM
Citation
 Zhu, YOlson, SHHermanowski-Vosatka, AMundt, SShah, KSpringer, MThieringer, RWright, SXiao, JZokian, HBalkovec, JM 4-Methyl-5-phenyl triazoles as selective inhibitors of 11beta-hydroxysteroid dehydrogenase type I. Bioorg Med Chem Lett 18:3405-11 (2008)  
Target
Name:
11-beta-hydroxysteroid dehydrogenase 1
Synonyms:
11-DH 11-beta-Hydroxysteroid Dehydrogenase 1 (11-beta-HSD1) 11beta-HSD1A Corticosteroid 11-beta-dehydrogenase isozyme 1 (11-beta-HSD-1) Hsd11 | Hsd11b1
Type:
Enzyme
Mol. Mass.:
32369.70
Organism:
Mus musculus (mouse)
Description:
P50172
Residue:
292
  
Inhibitor
Name:
BDBM50260880
Synonyms:
3-(3-Chloro-biphenyl-4-yl)-5-[1-(4-chloro-phenyl)-cyclobutyl]-4-methyl-4H-[1,2,4]triazole | CHEMBL494638
Type:
Small organic molecule
Emp. Form.:
C25H21Cl2N3
Mol. Mass.:
434.36
SMILES:
Cn1c(nnc1C1(CCC1)c1ccc(Cl)cc1)-c1ccc(cc1Cl)-c1ccccc1
: