Target
Serine/threonine-protein kinase Chk1
Ligand
BDBM50243531
Substrate
Meas. Tech.
ChEMBL_491561 (CHEMBL944207)
IC50
10±n/a nM
Citation
 Janetka, JWAlmeida, LAshwell, SBrassil, PJDaly, KDeng, CGero, TGlynn, REHorn, CLIoannidis, SLyne, PNewcombe, NJOza, VBPass, MSpringer, SKSu, MToader, DVasbinder, MMYu, DYu, YZabludoff, SD Discovery of a novel class of 2-ureido thiophene carboxamide checkpoint kinase inhibitors. Bioorg Med Chem Lett 18:4242-8 (2008)  
Target
Name:
Serine/threonine-protein kinase Chk1
Synonyms:
CHEK1 CHK1 checkpoint homolog Checkpoint kinase-1 (CHK1)
Type:
Enzyme Catalytic Domain
Mol. Mass.:
54443.02
Organism:
Homo sapiens (Human)
Description:
gi_166295192
Residue:
476
  
Inhibitor
Name:
BDBM50243531
Synonyms:
1-(5-(4-(2-(diethylamino)ethoxy)phenyl)-3-(piperidin-3-ylcarbamoyl)thiophen-2-yl)urea | CHEMBL518661
Type:
Small organic molecule
Emp. Form.:
C23H33N5O3S
Mol. Mass.:
459.605
SMILES:
CCN(CC)CCOc1ccc(cc1)-c1cc(C(=O)NC2CCCNC2)c(NC(N)=O)s1
: