Target
Serine/threonine-protein kinase Chk1
Ligand
BDBM50243471
Substrate
Meas. Tech.
ChEMBL_491561 (CHEMBL944207)
IC50
17±n/a nM
Citation
 Janetka, JWAlmeida, LAshwell, SBrassil, PJDaly, KDeng, CGero, TGlynn, REHorn, CLIoannidis, SLyne, PNewcombe, NJOza, VBPass, MSpringer, SKSu, MToader, DVasbinder, MMYu, DYu, YZabludoff, SD Discovery of a novel class of 2-ureido thiophene carboxamide checkpoint kinase inhibitors. Bioorg Med Chem Lett 18:4242-8 (2008)  
Target
Name:
Serine/threonine-protein kinase Chk1
Synonyms:
CHEK1 CHK1 checkpoint homolog Checkpoint kinase-1 (CHK1)
Type:
Enzyme Catalytic Domain
Mol. Mass.:
54443.02
Organism:
Homo sapiens (Human)
Description:
gi_166295192
Residue:
476
  
Inhibitor
Name:
BDBM50243471
Synonyms:
1-(3-carbamoyl-5-(4-((2,2,6,6-tetramethylpiperidin-1-yl)methyl)phenyl)thiophen-2-yl)urea | CHEMBL460685
Type:
Small organic molecule
Emp. Form.:
C22H30N4O2S
Mol. Mass.:
414.564
SMILES:
CC1(C)CCCC(C)(C)N1Cc1ccc(cc1)-c1cc(C(N)=O)c(NC(N)=O)s1
: