Target
Cytochrome P450 11B2, mitochondrial
Ligand
BDBM50272370
Substrate
Meas. Tech.
ChEMBL_510153 (CHEMBL1002226)
IC50
0.5±n/a nM
Citation
 Heim, RLucas, SGrombein, CMRies, CSchewe, KENegri, MMüller-Vieira, UBirk, BHartmann, RW Overcoming undesirable CYP1A2 inhibition of pyridylnaphthalene-type aldosterone synthase inhibitors: influence of heteroaryl derivatization on potency and selectivity. J Med Chem 51:5064-74 (2008)  
Target
Name:
Cytochrome P450 11B2, mitochondrial
Synonyms:
Aldosterone Synthase (CYP11B2) Aldosterone-synthesizing enzyme CYP11B2 Cytochrome P450 11B2 Cytochrome P450 11B2, mitochondrial P-450C18 | Steroid 18-hydroxylase
Type:
Protein
Mol. Mass.:
57582.15
Organism:
Homo sapiens (Human)
Description:
P19099
Residue:
503
  
Inhibitor
Name:
BDBM50272370
Synonyms:
4-(6-Methoxy-3-methyl-3,4-dihydronaphthalen-2-yl)isoquinoline | CHEMBL499044
Type:
Small organic molecule
Emp. Form.:
C21H19NO
Mol. Mass.:
301.3817
SMILES:
COc1ccc2C=C(C(C)Cc2c1)c1cncc2ccccc12
: