Target
Kappa-type opioid receptor
Ligand
BDBM50240437
Substrate
Meas. Tech.
ChEMBL_510227 (CHEMBL1005605)
Ki
0.120000±n/a nM
Citation
 Fulton, BSKnapp, BIBidlack, JMNeumeyer, JL Synthesis and pharmacological evaluation of hydrophobic esters and ethers of butorphanol at opioid receptors. Bioorg Med Chem Lett 18:4474-6 (2008)  
Target
Name:
Kappa-type opioid receptor
Synonyms:
K-OR-1 Kappa-opioid receptor (KOR) Kappa-type opioid receptor (KOR) OPIATE Kappa OPRK1 kappa opioid receptor (KOR)
Type:
G Protein-Coupled Receptor (GPCR)
Mol. Mass.:
42648.76
Organism:
Homo sapiens (Human)
Description:
P41145
Residue:
380
  
Inhibitor
Name:
BDBM50240437
Synonyms:
(-)-17-(cyclobutylmethyl)morphinan-3,14-diol (-)-butorphanol BUTORPHANOL US10231963, Table B.3 US11534436, Compound Table B.3 | US9656961, Example 00120
Type:
Small organic molecule
Emp. Form.:
C21H29NO2
Mol. Mass.:
327.4605
SMILES:
Oc1ccc2C[C@H]3N(CC4CCC4)CC[C@@]4(CCCC[C@@]34O)c2c1
: