Target
Macrophage colony-stimulating factor 1 receptor
Ligand
BDBM50244673
Substrate
Meas. Tech.
ChEMBL_512118 (CHEMBL980054)
IC50
14±n/a nM
Citation
 Scott, DAAquila, BMBebernitz, GACook, DJDakin, LADeegan, TLHattersley, MMIoannidis, SLyne, PDOmer, CAYe, MZheng, X Pyridyl and thiazolyl bisamide CSF-1R inhibitors for the treatment of cancer. Bioorg Med Chem Lett 18:4794-7 (2008)  
Target
Name:
Macrophage colony-stimulating factor 1 receptor
Synonyms:
CSF1R FMS Macrophage colony stimulating factor receptor Macrophage colony-stimulating factor 1 receptor (c-FMS) Proto-oncogene c-Fms c-fms | cFMS
Type:
Protein
Mol. Mass.:
107979.48
Organism:
Homo sapiens (Human)
Description:
P07333
Residue:
972
  
Inhibitor
Name:
BDBM50244673
Synonyms:
5-(3-Bromo-benzoylamino)-2-chloro-N-pyridin-3-yl-benzamide | CHEMBL461951
Type:
Small organic molecule
Emp. Form.:
C19H13BrClN3O2
Mol. Mass.:
430.682
SMILES:
Clc1ccc(NC(=O)c2cccc(Br)c2)cc1C(=O)Nc1cccnc1
: