Target
1-deoxy-D-xylulose-5-phosphate synthase
Ligand
BDBM50263929
Substrate
Meas. Tech.
ChEMBL_535725 (CHEMBL989742)
IC50
98400±n/a nM
Citation
 Mao, JEoh, HHe, RWang, YWan, BFranzblau, SGCrick, DCKozikowski, AP Structure-activity relationships of compounds targeting mycobacterium tuberculosis 1-deoxy-D-xylulose 5-phosphate synthase. Bioorg Med Chem Lett 18:5320-3 (2008)  
Target
Name:
1-deoxy-D-xylulose-5-phosphate synthase
Synonyms:
DXS_MYCTU | dxs
Type:
PROTEIN
Mol. Mass.:
67882.02
Organism:
Mycobacterium tuberculosis
Description:
ChEMBL_1441273
Residue:
638
  
Inhibitor
Name:
BDBM50263929
Synonyms:
3-(4-chlorophenyl)-5-methyl-2-(trifluoromethyl)pyrazolo[1,5-a]pyrimidin-7(4H)-one | CHEMBL491399
Type:
Small organic molecule
Emp. Form.:
C14H9ClF3N3O
Mol. Mass.:
327.689
SMILES:
Cc1cc(=O)n2[nH]c(c(-c3ccc(Cl)cc3)c2n1)C(F)(F)F
: