Target
Acetylcholinesterase
Ligand
BDBM10624
Substrate
Meas. Tech.
ChEMBL_534770 (CHEMBL986294)
IC50
63±n/a nM
Citation
 Carolan, CGDillon, GPGaynor, JMReidy, SRyder, SAKhan, DMarquez, JFGilmer, JF Isosorbide-2-carbamate esters: potent and selective butyrylcholinesterase inhibitors. J Med Chem 51:6400-9 (2008)  
Target
Name:
Acetylcholinesterase
Synonyms:
ACES_ELEEL Acetylcholinesterase (EeAChE) | ache
Type:
Enzyme
Mol. Mass.:
71812.79
Organism:
Electrophorus electricus (Electric eel)
Description:
Residue:
633
  
Inhibitor
Name:
BDBM10624
Synonyms:
1,5-bis(4-allyldimethylammoniumphenyl)-pentan-3-one dibromide BW284c51 CHEMBL464538
Type:
Small organic molecule
Emp. Form.:
C27H38N2O
Mol. Mass.:
406.6023
SMILES:
C[N+](C)(CC=C)c1ccc(CCC(=O)CCc2ccc(cc2)[N+](C)(C)CC=C)cc1
: