Target
E3 ubiquitin-protein ligase XIAP
Ligand
BDBM26218
Substrate
Meas. Tech.
ChEMBL_516264 (CHEMBL985934)
Ki
26±n/a nM
Citation
 Sun, WNikolovska-Coleska, ZQin, DSun, HYang, CYBai, LQiu, SWang, YMa, DWang, S Design, synthesis, and evaluation of potent, nonpeptidic mimetics of second mitochondria-derived activator of caspases. J Med Chem 52:593-6 (2009)  
Target
Name:
E3 ubiquitin-protein ligase XIAP
Synonyms:
API3 E3 ubiquitin-protein ligase XIAP Inhibitor of apoptosis protein 3 X-linked inhibitor of apoptosis XIAP | XIAP_HUMAN
Type:
Protein
Mol. Mass.:
56685.27
Organism:
Homo sapiens (Human)
Description:
P98170
Residue:
497
  
Inhibitor
Name:
BDBM26218
Synonyms:
(3S,6S,10aS)-N-(diphenylmethyl)-6-[(2S)-2-(methylamino)propanamido]-5-oxo-decahydropyrrolo[1,2-a]azocine-3-carboxamide bicyclic Smac peptide mimetic, 20
Type:
Small organic molecule
Emp. Form.:
C28H36N4O3
Mol. Mass.:
476.6104
SMILES:
CN[C@@H](C)C(=O)N[C@H]1CCCC[C@H]2CC[C@H](N2C1=O)C(=O)NC(c1ccccc1)c1ccccc1
: