Target
Muscarinic acetylcholine receptor M1
Ligand
BDBM50222912
Substrate
Meas. Tech.
ChEMBL_519763 (CHEMBL939026)
EC50
>10000±n/a nM
Citation
 Bridges, TMMarlo, JENiswender, CMJones, CKJadhav, SBGentry, PRPlumley, HCWeaver, CDConn, PJLindsley, CW Discovery of the first highly M5-preferring muscarinic acetylcholine receptor ligand, an M5 positive allosteric modulator derived from a series of 5-trifluoromethoxy N-benzyl isatins. J Med Chem 52:3445-8 (2009)  
Target
Name:
Muscarinic acetylcholine receptor M1
Synonyms:
ACM1_RAT Chrm-1 cholinergic receptor, muscarinic 1
Type:
Enzyme Catalytic Domain
Mol. Mass.:
51390.46
Organism:
RAT
Description:
P08482
Residue:
460
  
Inhibitor
Name:
BDBM50222912
Synonyms:
1-(4-methoxybenzyl)indoline-2,3-dione N-(p-methoxybenzyl)isatin
Type:
Small organic molecule
Emp. Form.:
C16H13NO3
Mol. Mass.:
267.2793
SMILES:
COc1ccc(CN2C(=O)C(=O)c3ccccc23)cc1
: