Target
Seed linoleate 13S-lipoxygenase-1
Ligand
BDBM50280214
Substrate
Meas. Tech.
ChEBML_101366
Ki
>100000±n/a nM
Citation
 Wright, SWNelson, MJ Episulfide inhibitors of lipoxygenase Bioorg Med Chem Lett 2:1385-1390 (1992)    Article 
Target
Name:
Seed linoleate 13S-lipoxygenase-1
Synonyms:
15-LOX 15-lipo-oxygenase (SLO) L-1 LOX1.1 Lipoxygenase (LOX) Lipoxygenase-1 | Seed lipoxygenase-1
Type:
Enzyme
Mol. Mass.:
94365.66
Organism:
Glycine max (soybean)
Description:
Residue:
839
  
Inhibitor
Name:
BDBM50280214
Synonyms:
8-(3-Octyl-oxiranyl)-octanoic acid | CHEMBL27918
Type:
Small organic molecule
Emp. Form.:
C18H34O3
Mol. Mass.:
298.4608
SMILES:
CCCCCCCCC1OC1CCCCCCCC(O)=O
: