Target
Muscarinic acetylcholine receptor M1
Ligand
BDBM50281902
Substrate
Meas. Tech.
ChEBML_139843
Kd
2.7±n/a nM
Citation
 Malaska, MJFauq, AHKozikowski, APAagaard, PJMcKinney, M Simplified analogs of himbacine displaying potent binding affinity for muscarinic receptors Bioorg Med Chem Lett 3:1247-1252 (1993)    Article 
Target
Name:
Muscarinic acetylcholine receptor M1
Synonyms:
ACM1_HUMAN Cholinergic receptor, muscarinic 1 | Cholinergic, muscarinic M1
Type:
Protein
Mol. Mass.:
51442.54
Organism:
Homo sapiens (Human)
Description:
P11229
Residue:
460
  
Inhibitor
Name:
BDBM50281902
Synonyms:
(R)-2-[2-(10H-Anthracen-9-ylidene)-ethyl]-1-methyl-piperidine | CHEMBL279712
Type:
Small organic molecule
Emp. Form.:
C22H25N
Mol. Mass.:
303.4406
SMILES:
[#6]-[#7]-1-[#6]-[#6]-[#6]-[#6]-[#6@@H]-1-[#6]\[#6]=[#6]-1\c2ccccc2-[#6]-c2ccccc-12
: