Target
Muscarinic acetylcholine receptor M1
Ligand
BDBM50281909
Substrate
Meas. Tech.
ChEBML_139843
Kd
1.5±n/a nM
Citation
 Malaska, MJFauq, AHKozikowski, APAagaard, PJMcKinney, M Simplified analogs of himbacine displaying potent binding affinity for muscarinic receptors Bioorg Med Chem Lett 3:1247-1252 (1993)    Article 
Target
Name:
Muscarinic acetylcholine receptor M1
Synonyms:
ACM1_HUMAN Cholinergic receptor, muscarinic 1 | Cholinergic, muscarinic M1
Type:
Protein
Mol. Mass.:
51442.54
Organism:
Homo sapiens (Human)
Description:
P11229
Residue:
460
  
Inhibitor
Name:
BDBM50281909
Synonyms:
(R)-2-[(E)-2-(9,10-Dihydro-anthracen-9-yl)-vinyl]-1-methyl-piperidine | CHEMBL22829
Type:
Small organic molecule
Emp. Form.:
C22H25N
Mol. Mass.:
303.4406
SMILES:
CN1CCCC[C@@H]1\C=C\C1c2ccccc2Cc2ccccc12
: