Target
Prostaglandin G/H synthase 1
Ligand
BDBM17638
Substrate
Meas. Tech.
ChEBML_158593
IC50
100±n/a nM
Citation
 Reitz, DBHuang, HCLi, JJGarland, DJManning, REAnderson, GDGregory, SAKoboldt, CMPerkins, WESeibert, KIsakson, PC Selective cyclooxygenase inhibitors: Novel 4-spiro 1,2-diarylcyclopentenes are potent and orally active cox-2 inhibitors Bioorg Med Chem Lett 5:867-872 (1995)    Article 
Target
Name:
Prostaglandin G/H synthase 1
Synonyms:
COX-1 Cyclooxygenase Cyclooxygenase-1 (COX-1) PTGS1 | Prostaglandin G/H synthase (cyclooxygenase)
Type:
Enzyme
Mol. Mass.:
68692.62
Organism:
Homo sapiens (Human)
Description:
P23219
Residue:
599
  
Inhibitor
Name:
BDBM17638
Synonyms:
2-{1-[(4-chlorophenyl)carbonyl]-5-methoxy-2-methyl-1H-indol-3-yl}acetic acid Indocin US11478464, Compound Indomethacin US9271961, Indomethacin | indometacin
Type:
Small organic molecule
Emp. Form.:
C19H16ClNO4
Mol. Mass.:
357.788
SMILES:
COc1ccc2n(C(=O)c3ccc(Cl)cc3)c(C)c(CC(O)=O)c2c1
: