Target
DNA topoisomerase 1
Ligand
BDBM50008936
Substrate
Meas. Tech.
ChEBML_208416
IC50
1800±n/a nM
Citation
 Candiani, IBedeschi, ACabri, WZarini, FVisentin, GCapolongo, LGeroni, CCiomei, M Synthesis and cytotoxic activity of alkylidene- and alkyl-substituted camptothecins Bioorg Med Chem Lett 7:847-850 (1997)    Article 
Target
Name:
DNA topoisomerase 1
Synonyms:
DNA topoisomerase I TOP1 | TOP1_HUMAN
Type:
Enzyme
Mol. Mass.:
90771.02
Organism:
Homo sapiens (Human)
Description:
P11387
Residue:
765
  
Inhibitor
Name:
BDBM50008936
Synonyms:
(S)-10-Amino-4-ethyl-4-hydroxy-1,12-dihydro-4H-2-oxa-6,12a-diaza-dibenzo[b,h]fluorene-3,13-dione 9-aminocamptothecan cid_72402
Type:
Small organic molecule
Emp. Form.:
C20H17N3O4
Mol. Mass.:
363.3667
SMILES:
CC[C@@]1(O)C(=O)OCc2c1cc1-c3nc4cccc(N)c4cc3Cn1c2=O
: