Target
Aldo-keto reductase family 1 member C1
Ligand
BDBM50293437
Substrate
Meas. Tech.
ChEMBL_572850 (CHEMBL1033526)
Ki
48500±n/a nM
Citation
 Stefane, BBrozic, PVehovc, MRizner, TLGobec, S New cyclopentane derivatives as inhibitors of steroid metabolizing enzymes AKR1C1 and AKR1C3. Eur J Med Chem 44:2563-71 (2009)  
Target
Name:
Aldo-keto reductase family 1 member C1
Synonyms:
20-alpha-HSD AK1C1_HUMAN Aldo-keto reductase family 1 member C1 (AK1C1) Aldo-keto reductase family 1 member C1 (AKR1C1) DDH High-affinity hepatic bile acid-binding protein | Trans-1,2-dihydrobenzene-1,2-diol dehydrogenase
Type:
Enzyme
Mol. Mass.:
36793.97
Organism:
Homo sapiens (Human)
Description:
Recombinant AKR1C1 enzyme was expressed in E. coli.
Residue:
323
  
Inhibitor
Name:
BDBM50293437
Synonyms:
3-Phenylcyclopentanecarboxylic acid | CHEMBL554283
Type:
Small organic molecule
Emp. Form.:
C12H14O2
Mol. Mass.:
190.2384
SMILES:
OC(=O)C1CCC(C1)c1ccccc1
: