Target
Beta-secretase 1
Ligand
BDBM15798
Substrate
Meas. Tech.
ChEMBL_575805 (CHEMBL1024506)
IC50
15±n/a nM
Citation
 Wu, YJZhang, YGood, ACBurton, CRToyn, JHAlbright, CFMacor, JEThompson, LA Synthesis and SAR of hydroxyethylamine based phenylcarboxyamides as inhibitors of BACE. Bioorg Med Chem Lett 19:2654-60 (2009)  
Target
Name:
Beta-secretase 1
Synonyms:
ASP2 Aspartyl protease 2 BACE1 Beta-secretase (BACE) Beta-secretase 1 (BACE 1) Beta-secretase 1 (BACE1) Beta-site amyloid precursor protein cleaving enzyme 1 Memapsin-2 beta-Secretase (BACE-1) | beta-Secretase (BACE1)
Type:
Protein
Mol. Mass.:
55755.10
Organism:
Homo sapiens (Human)
Description:
P56817
Residue:
501
  
Inhibitor
Name:
BDBM15798
Synonyms:
(1S,2R)-N-[1-(3,5-Difluorobenzyl)-2-hydroxy-3-(3-methoxybenzylamino)-propyl]-5-methyl-N,N-dipropylisophthalamide hydroxyethyl secondary amine (HEA) inhibitor 6c
Type:
Small organic molecule
Emp. Form.:
C33H41F2N3O4
Mol. Mass.:
581.6931
SMILES:
CCCN(CCC)C(=O)c1cc(C)cc(c1)C(=O)N[C@@H](Cc1cc(F)cc(F)c1)[C@H](O)CNCc1cccc(OC)c1
: