Target
Enoyl-acyl-carrier protein reductase
Ligand
BDBM8726
Substrate
Meas. Tech.
ChEMBL_577751 (CHEMBL1053058)
IC50
73±n/a nM
Citation
 Frecer, VMegnassan, EMiertus, S Design and in silico screening of combinatorial library of antimalarial analogs of triclosan inhibiting Plasmodium falciparum enoyl-acyl carrier protein reductase. Eur J Med Chem 44:3009-19 (2009)  
Target
Name:
Enoyl-acyl-carrier protein reductase
Synonyms:
Type:
PROTEIN
Mol. Mass.:
49770.86
Organism:
Plasmodium falciparum
Description:
ChEMBL_795989
Residue:
432
  
Inhibitor
Name:
BDBM8726
Synonyms:
5-chloro-2-(2,4-dichlorophenoxy)phenol TCL US20230414581, Compound 35
Type:
Small organic molecule
Emp. Form.:
C12H7Cl3O2
Mol. Mass.:
289.542
SMILES:
Oc1cc(Cl)ccc1Oc1ccc(Cl)cc1Cl
: