Target
Alpha-2A adrenergic receptor
Ligand
BDBM50203564
Substrate
Meas. Tech.
ChEMBL_592538 (CHEMBL1046745)
IC50
3.67±n/a nM
Citation
 Biancalani, CGiovannoni, MPPieretti, SCesari, NGraziano, AVergelli, CCilibrizzi, ADi Gianuario, AColucci, MMangano, GGarrone, BPolenzani, LDal Piaz, V Further studies on arylpiperazinyl alkyl pyridazinones: discovery of an exceptionally potent, orally active, antinociceptive agent in thermally induced pain. J Med Chem 52:7397-409 (2009)  
Target
Name:
Alpha-2A adrenergic receptor
Synonyms:
ADA2A_HUMAN ADRA2R Adrenergic alpha2A Alpha-2 adrenergic receptor subtype C10 Alpha-2A adrenoreceptor alpha-2A adrenergic receptor [Homo sapiens]
Type:
Enzyme
Mol. Mass.:
48979.91
Organism:
Homo sapiens (Human)
Description:
P08913
Residue:
465
  
Inhibitor
Name:
BDBM50203564
Synonyms:
(1R,2S,4aR,13bS,14aS)-2-hydroxy-1,2,3,4,4a,5,7,8,13,13b,14,14a-dodecahydro-indolo[2',3':3,4]pyrido[1,2-b]isoquinoline-1-carboxylic acid methyl ester hydrochloride Yohimbine Hydrochloride | cid_6169
Type:
Small organic molecule
Emp. Form.:
C21H26N2O3
Mol. Mass.:
354.4427
SMILES:
COC(=O)[C@H]1[C@@H](O)CC[C@H]2CN3CCc4c([nH]c5ccccc45)[C@@H]3C[C@H]12
: