Target
Sodium-dependent noradrenaline transporter
Ligand
BDBM50299796
Substrate
Meas. Tech.
ChEMBL_589383 (CHEMBL1047378)
Ki
3±n/a nM
Citation
 Gray, DLXu, WCampbell, BMDounay, ABBarta, NBoroski, SDenny, LEvans, LStratman, NProbert, A Discovery and pharmacological characterization of aryl piperazine and piperidine ethers as dual acting norepinephrine reuptake inhibitors and 5-HT1A partial agonists. Bioorg Med Chem Lett 19:6604-7 (2009)  
Target
Name:
Sodium-dependent noradrenaline transporter
Synonyms:
Monoamine transporter NET Noradrenaline Transporter (NET) Norepinephrine transporter protein (NET) SLC6A2 Sodium-dependent noradrenaline transporter (NET) | Solute carrier family 6 member 2
Type:
Multi-pass membrane protein
Mol. Mass.:
69337.72
Organism:
Homo sapiens (Human)
Description:
P23975
Residue:
617
  
Inhibitor
Name:
BDBM50299796
Synonyms:
4-(2-(2-fluoro-5-methylphenoxy)phenyl)piperidine | CHEMBL583332
Type:
Small organic molecule
Emp. Form.:
C18H20FNO
Mol. Mass.:
285.3559
SMILES:
Cc1ccc(F)c(Oc2ccccc2C2CCNCC2)c1
: