Target
5-hydroxytryptamine receptor 1A
Ligand
BDBM50299787
Substrate
Meas. Tech.
ChEMBL_589382 (CHEMBL1047377)
Ki
4±n/a nM
Citation
 Gray, DLXu, WCampbell, BMDounay, ABBarta, NBoroski, SDenny, LEvans, LStratman, NProbert, A Discovery and pharmacological characterization of aryl piperazine and piperidine ethers as dual acting norepinephrine reuptake inhibitors and 5-HT1A partial agonists. Bioorg Med Chem Lett 19:6604-7 (2009)  
Target
Name:
5-hydroxytryptamine receptor 1A
Synonyms:
5-HT-1A 5-hydroxytryptamine receptor 1A (5-HT-1A) ADRB2RL1 Dopamine D2 receptor and serotonin 1a receptor HTR1A | Serotonin receptor 1A
Type:
Mol. Mass.:
46122.49
Organism:
Homo sapiens (Human)
Description:
Residue:
422
  
Inhibitor
Name:
BDBM50299787
Synonyms:
4-(2,4-difluorophenyl)-2-(2-(piperazin-1-yl)benzylidene)thiomorpholin-3-one | CHEMBL575699
Type:
Small organic molecule
Emp. Form.:
C21H21F2N3OS
Mol. Mass.:
401.473
SMILES:
Fc1ccc(N2CCS\C(=C/c3ccccc3N3CCNCC3)C2=O)c(F)c1
: