Target
Transporter
Ligand
BDBM50198230
Substrate
Meas. Tech.
ChEMBL_598777 (CHEMBL1042017)
Ki
0.84±n/a nM
Citation
 Jobson, NKCrawford, ARDewar, DPimlott, SLSutherland, A Design and synthesis of (2R,3S)-iodoreboxetine analogues for SPECT imaging of the noradrenaline transporter. Bioorg Med Chem Lett 19:4996-8 (2009)  
Target
Name:
Transporter
Synonyms:
NE transporter Norepinephrine transporter(NET)
Type:
Multi-pass membrane protein
Mol. Mass.:
69236.90
Organism:
Rattus norvegicus (rat)
Description:
Q63380
Residue:
617
  
Inhibitor
Name:
BDBM50198230
Synonyms:
(S)-2-((S)-(2-iodophenoxy)(phenyl)methyl)morpholine | CHEMBL393236
Type:
Small organic molecule
Emp. Form.:
C17H18INO2
Mol. Mass.:
395.2348
SMILES:
Ic1ccccc1O[C@H]([C@@H]1CNCCO1)c1ccccc1
: