Target
Dual specificity protein phosphatase 3
Ligand
BDBM50303181
Substrate
Meas. Tech.
ChEMBL_595099 (CHEMBL1047959)
Ki
2940±n/a nM
Citation
 Wu, SVossius, SRahmouni, SMiletic, AVVang, TVazquez-Rodriguez, JCerignoli, FArimura, YWilliams, SHayes, TMoutschen, MVasile, SPellecchia, MMustelin, TTautz, L Multidentate small-molecule inhibitors of vaccinia H1-related (VHR) phosphatase decrease proliferation of cervix cancer cells. J Med Chem 52:6716-23 (2009)  
Target
Name:
Dual specificity protein phosphatase 3
Synonyms:
DUS3_HUMAN Dual specificity protein phosphatase (VHR) Dual specificity protein phosphatase VHR Tyrosine-protein phosphatase non-receptor type 1 | VHR
Type:
Hydrolase
Mol. Mass.:
20480.58
Organism:
Homo sapiens (Human)
Description:
Residue:
185
  
Inhibitor
Name:
BDBM50303181
Synonyms:
1-(dibenzo[b,d]furan-3-yl)-3-(naphthalen-1-yl)thiourea | CHEMBL567047
Type:
Small organic molecule
Emp. Form.:
C23H16N2OS
Mol. Mass.:
368.451
SMILES:
S=C(Nc1ccc2c(c1)oc1ccccc21)Nc1cccc2ccccc12
: