Target
Cytochrome P450 2C9
Ligand
BDBM50303662
Substrate
Meas. Tech.
ChEMBL_596862 (CHEMBL1045321)
IC50
30±n/a nM
Citation
 Singh, JZeller, WZhou, NHategan, GMishra, RKPolozov, AYu, POnua, EZhang, JRamírez, JLSigthorsson, GThorsteinnsdottir, MKiselyov, ASZembower, DEAndrésson, TGurney, ME Structure-activity relationship studies leading to the identification of (2E)-3-[l-[(2,4-dichlorophenyl)methyl]-5-fluoro-3-methyl-lH-indol-7-yl]-N-[(4,5-dichloro-2-thienyl)sulfonyl]-2-propenamide (DG-041), a potent and selective prostanoid EP3 receptor antagonist, as a novel antiplatelet agent that J Med Chem 53:18-36 (2010)  
Target
Name:
Cytochrome P450 2C9
Synonyms:
(R)-limonene 6-monooxygenase CP2C9_HUMAN CYP2C9 Cytochrome P450 2C9 (CYP2C9 ) P-450MP P450 PB-1 | S-mephenytoin 4-hydroxylase
Type:
Enzyme
Mol. Mass.:
55636.33
Organism:
Homo sapiens (Human)
Description:
P11712
Residue:
490
  
Inhibitor
Name:
BDBM50303662
Synonyms:
3-(1-(2,4-dichlorobenzyl)-5-fluoro-3-methyl-1H-indol-7-yl)-N-(4,5-dichlorothiophen-2-ylsulfonyl)acrylamide | CHEMBL565591
Type:
Small organic molecule
Emp. Form.:
C23H15Cl4FN2O3S2
Mol. Mass.:
592.317
SMILES:
Cc1cn(Cc2ccc(Cl)cc2Cl)c2c(\C=C\C(=O)NS(=O)(=O)c3cc(Cl)c(Cl)s3)cc(F)cc12
: