Target
Hepatocyte nuclear factor 4-alpha
Ligand
BDBM22594
Substrate
Meas. Tech.
ChEMBL_606516 (CHEMBL1065467)
EC50
1470±n/a nM
Citation
 Le Guével, ROger, FLecorgne, ADudasova, ZChevance, SBondon, ABarath, PSimonneaux, GSalbert, G Identification of small molecule regulators of the nuclear receptor HNF4alpha based on naphthofuran scaffolds. Bioorg Med Chem 17:7021-30 (2009)  
Target
Name:
Hepatocyte nuclear factor 4-alpha
Synonyms:
HNF4 HNF4A_HUMAN TCF14 | hepatocyte nuclear factor 4-alpha isoform b
Type:
PROTEIN
Mol. Mass.:
52790.24
Organism:
Homo sapiens (Human)
Description:
ChEMBL_606516
Residue:
474
  
Inhibitor
Name:
BDBM22594
Synonyms:
7-methoxy-4-nitro-5-oxatricyclo[7.4.0.0^{2,6}]trideca-1(13),2(6),3,7,9,11-hexaene | Compound D15
Type:
Small organic molecule
Emp. Form.:
C13H9NO4
Mol. Mass.:
243.2149
SMILES:
COc1cc2ccccc2c2cc(oc12)[N+]([O-])=O
: