Target
Hypoxia-inducible factor 1-alpha inhibitor
Ligand
BDBM50304615
Substrate
Meas. Tech.
ChEMBL_606822 (CHEMBL1068586)
IC50
73100±n/a nM
Citation
 Ko, SLee, MKShin, DPark, H Structure-based virtual screening approach to the discovery of novel inhibitors of factor-inhibiting HIF-1: identification of new chelating groups for the active-site ferrous ion. Bioorg Med Chem 17:7769-74 (2009)  
Target
Name:
Hypoxia-inducible factor 1-alpha inhibitor
Synonyms:
FIH1 HIF1N_HUMAN Hypoxia-inducible factor 1-alpha inhibitor
Type:
Enzyme
Mol. Mass.:
40278.92
Organism:
Homo sapiens (Human)
Description:
Q9NWT6
Residue:
349
  
Inhibitor
Name:
BDBM50304615
Synonyms:
CHEMBL593738 | N-(benzo[c][1,2,5]oxadiazol-4-yl)-3-(5-(3-methoxybenzylidene)-4-oxo-2-thioxothiazolidin-3-yl)propanamide
Type:
Small organic molecule
Emp. Form.:
C20H16N4O4S2
Mol. Mass.:
440.495
SMILES:
COc1cccc(\C=C2/SC(=S)N(CCC(=O)Nc3cccc4nonc34)C2=O)c1
: