Target
Muscarinic acetylcholine receptor M5
Ligand
BDBM50305817
Substrate
Meas. Tech.
ChEMBL_605048 (CHEMBL1071910)
EC50
1900±n/a nM
Citation
 Bridges, TMKennedy, JPCho, HPBreininger, MLGentry, PRHopkins, CRConn, PJLindsley, CW Chemical lead optimization of a pan G(q) mAChR M(1), M(3), M(5) positive allosteric modulator (PAM) lead. Part I: Development of the first highly selective M(5) PAM. Bioorg Med Chem Lett 20:558-62 (2010)  
Target
Name:
Muscarinic acetylcholine receptor M5
Synonyms:
ACM5_HUMAN | CHRM5
Type:
PROTEIN
Mol. Mass.:
60102.35
Organism:
Homo sapiens (Human)
Description:
ChEMBL_1517990
Residue:
532
  
Inhibitor
Name:
BDBM50305817
Synonyms:
1-(4-phenoxybenzyl)-5-(trifluoromethoxy)indoline-2,3-dione cid_44602489
Type:
Small organic molecule
Emp. Form.:
C22H14F3NO4
Mol. Mass.:
413.3461
SMILES:
FC(F)(F)Oc1ccc2N(Cc3ccc(Oc4ccccc4)cc3)C(=O)C(=O)c2c1
: