Target
Muscarinic acetylcholine receptor M1
Ligand
BDBM50258439
Substrate
Meas. Tech.
ChEMBL_605044 (CHEMBL1071304)
EC50
6100±n/a nM
Citation
 Bridges, TMKennedy, JPCho, HPBreininger, MLGentry, PRHopkins, CRConn, PJLindsley, CW Chemical lead optimization of a pan G(q) mAChR M(1), M(3), M(5) positive allosteric modulator (PAM) lead. Part I: Development of the first highly selective M(5) PAM. Bioorg Med Chem Lett 20:558-62 (2010)  
Target
Name:
Muscarinic acetylcholine receptor M1
Synonyms:
ACM1_RAT Chrm-1 cholinergic receptor, muscarinic 1
Type:
Enzyme Catalytic Domain
Mol. Mass.:
51390.46
Organism:
RAT
Description:
P08482
Residue:
460
  
Inhibitor
Name:
BDBM50258439
Synonyms:
1-(4-bromobenzyl)indoline-2,3-dione CVD-0005886 VU0119498 | cid_3008304
Type:
Small organic molecule
Emp. Form.:
C15H10BrNO2
Mol. Mass.:
316.149
SMILES:
Brc1ccc(CN2C(=O)C(=O)c3ccccc23)cc1
: