Target
Acyl-CoA desaturase 1
Ligand
BDBM50306128
Substrate
Meas. Tech.
ChEMBL_606059 (CHEMBL1071958)
IC50
2±n/a nM
Citation
 Uto, YKiyotsuka, YUeno, YMiyazawa, YKurata, HOgata, TDeguchi, TYamada, MWatanabe, NKonishi, MKurikawa, NTakagi, TWakimoto, SKono, KOhsumi, J Novel spiropiperidine-based stearoyl-CoA desaturase-1 inhibitors: Identification of 1'-{6-[5-(pyridin-3-ylmethyl)-1,3,4-oxadiazol-2-yl]pyridazin-3-yl}-5-(trifluoromethyl)-3,4-dihydrospiro[chromene-2,4'-piperidine]. Bioorg Med Chem Lett 20:746-54 (2010)  
Target
Name:
Acyl-CoA desaturase 1
Synonyms:
ACOD1_MOUSE | Scd1
Type:
PROTEIN
Mol. Mass.:
41064.54
Organism:
Mus musculus
Description:
ChEMBL_1462109
Residue:
355
  
Inhibitor
Name:
BDBM50306128
Synonyms:
1-(pyridin-3-ylmethyl)-3-(6-(5-(trifluoromethyl)spiro[chroman-2,4'-piperidine]-1'-yl)pyridazin-3-yl)urea | CHEMBL606037
Type:
Small organic molecule
Emp. Form.:
C25H25F3N6O2
Mol. Mass.:
498.5002
SMILES:
FC(F)(F)c1cccc2OC3(CCN(CC3)c3ccc(NC(=O)NCc4cccnc4)nn3)CCc12
: