Target
Proteasome subunit beta type-5
Ligand
BDBM50307482
Substrate
Meas. Tech.
ChEMBL_611028 (CHEMBL1073017)
IC50
2±n/a nM
Citation
 Geurink, PPLiu, NSpaans, MPDowney, SLvan den Nieuwendijk, AMvan der Marel, GAKisselev, AFFlorea, BIOverkleeft, HS Incorporation of fluorinated phenylalanine generates highly specific inhibitor of proteasome's chymotrypsin-like sites. J Med Chem 53:2319-23 (2010)  
Target
Name:
Proteasome subunit beta type-5
Synonyms:
20S proteasome chymotrypsin-like LMPX PSB5_HUMAN Proteasome Macropain subunit MB1 X
Type:
Protein
Mol. Mass.:
28480.96
Organism:
Homo sapiens (Human)
Description:
Residue:
263
  
Inhibitor
Name:
BDBM50307482
Synonyms:
(S)-2-azido-N-((S)-1-((S)-1-((S)-4-methyl-1-((R)-2-methyloxiran-2-yl)-1-oxopentan-2-ylamino)-1-oxo-3-(perfluorophenyl)propan-2-ylamino)-1-oxo-3-phenylpropan-2-yl)-3-phenylpropanamide | CHEMBL578885
Type:
Small organic molecule
Emp. Form.:
C36H37F5N6O5
Mol. Mass.:
728.7082
SMILES:
CC(C)C[C@H](NC(=O)[C@H](Cc1c(F)c(F)c(F)c(F)c1F)NC(=O)[C@H](Cc1ccccc1)NC(=O)[C@H](Cc1ccccc1)N=[N+]=[N-])C(=O)[C@@]1(C)CO1
: