Target
Telomerase reverse transcriptase
Ligand
BDBM50134017
Substrate
Meas. Tech.
ChEMBL_622825 (CHEMBL1105835)
IC50
170±n/a nM
Citation
 Castillo-González, DCabrera-Pérez, MAPérez-González, MMorales Helguera, ADurán-Martínez, A Prediction of telomerase inhibitory activity for acridinic derivatives based on chemical structure. Eur J Med Chem 44:4826-40 (2009)  
Target
Name:
Telomerase reverse transcriptase
Synonyms:
EST2 TERT TRT
Type:
PROTEIN
Mol. Mass.:
127099.03
Organism:
Homo sapiens (Human)
Description:
ChEMBL_1447029
Residue:
1132
  
Inhibitor
Name:
BDBM50134017
Synonyms:
CHEMBL138357 N-[9-(4-Dimethylamino-phenylamino)-6-(3-pyrrolidin-1-yl-propionylamino)-acridin-2-yl]-3-pyrrolidin-1-yl-propionamide
Type:
Small organic molecule
Emp. Form.:
C35H43N7O2
Mol. Mass.:
593.7616
SMILES:
CN(C)c1ccc(Nc2c3ccc(NC(=O)CCN4CCCC4)cc3nc3ccc(NC(=O)CCN4CCCC4)cc23)cc1
: