Target
Thioredoxin reductase 1, cytoplasmic
Ligand
BDBM50315537
Substrate
Meas. Tech.
ChEMBL_626863 (CHEMBL1110820)
IC50
4600±n/a nM
Citation
 Watts, KRRatnam, JAng, KHTenney, KCompton, JEMcKerrow, JCrews, P Assessing the trypanocidal potential of natural and semi-synthetic diketopiperazines from two deep water marine-derived fungi. Bioorg Med Chem 18:2566-74 (2010)  
Target
Name:
Thioredoxin reductase 1, cytoplasmic
Synonyms:
GRIM-12 Gene associated with retinoid-IFN-induced mortality 12 protein KM-102-derived reductase-like factor TRXR1_HUMAN Thioredoxin reductase 1 Thioredoxin reductase TR1
Type:
Protein
Mol. Mass.:
70761.78
Organism:
Homo sapiens (Human)
Description:
Q16881
Residue:
648
  
Inhibitor
Name:
BDBM50315537
Synonyms:
CHEMBL1089316 | chaetocin
Type:
Small organic molecule
Emp. Form.:
C30H28N6O6S4
Mol. Mass.:
696.84
SMILES:
CN1C(=O)[C@@]23C[C@]4([C@H](Nc5ccccc45)N2C(=O)[C@]1(CO)SS3)[C@]12C[C@]34SS[C@](CO)(N(C)C3=O)C(=O)N4[C@H]1Nc1ccccc21
: