Target
Glutamate receptor 2
Ligand
BDBM50060635
Substrate
Meas. Tech.
ChEMBL_628005 (CHEMBL1105526)
EC50
463±n/a nM
Citation
 Fleming, JJEngland, PM Developing a complete pharmacology for AMPA receptors: a perspective on subtype-selective ligands. Bioorg Med Chem 18:1381-7 (2010)  
Target
Name:
Glutamate receptor 2
Synonyms:
AMPA-selective glutamate receptor 2 GRIA2 GluR-2 GluR-K2 Glutamate receptor 2 Glutamate receptor AMPA 2/3 Glutamate receptor ionotropic, AMPA 2
Type:
Enzyme Catalytic Domain
Mol. Mass.:
98825.96
Organism:
Homo sapiens (Human)
Description:
Glutamate AMPA 2 GRIA2 HUMAN::P42262
Residue:
883
  
Inhibitor
Name:
BDBM50060635
Synonyms:
(S)-2-Amino-3-(5-fluoro-2,4-dioxo-3,4-dihydro-2H-pyrimidin-1-yl)-propionic acid (S)-5-Fluorowillardiine CHEMBL123132 | Fluorowillardiine
Type:
Small organic molecule
Emp. Form.:
C7H8FN3O4
Mol. Mass.:
217.1545
SMILES:
N[C@@H](Cn1cc(F)c(=O)[nH]c1=O)C(O)=O
: