Target
P2Y purinoceptor 2
Ligand
BDBM50319144
Substrate
Meas. Tech.
ChEMBL_635658 (CHEMBL1119550)
EC50
16±n/a nM
Citation
 Maruoka, HBarrett, MOKo, HTosh, DKMelman, ABurianek, LEBalasubramanian, RBerk, BCostanzi, SHarden, TKJacobson, KA Pyrimidine ribonucleotides with enhanced selectivity as P2Y(6) receptor agonists: novel 4-alkyloxyimino, (S)-methanocarba, and 5'-triphosphate gamma-ester modifications. J Med Chem 53:4488-501 (2010)  
Target
Name:
P2Y purinoceptor 2
Synonyms:
ATP receptor P2RY2 P2U purinoceptor 1 P2Y purinoceptor 2 Purinergic receptor | Purinergic receptor P2Y2
Type:
PROTEIN
Mol. Mass.:
42299.21
Organism:
Homo sapiens (Human)
Description:
ChEMBL_1455361
Residue:
377
  
Inhibitor
Name:
BDBM50319144
Synonyms:
((1S,2S,4S,5S)-4-(2,4-dioxo-3,4-dihydropyrimidin-1(2H)-yl)-2-hydroxybicyclo[3.1.0]hexan-1-yl)methyl tetrahydrogen triphosphate | CHEMBL1083763
Type:
Small organic molecule
Emp. Form.:
C11H17N2O13P3
Mol. Mass.:
478.1796
SMILES:
O[C@H]1C[C@@H]([C@H]2C[C@]12COP(O)(=O)OP(O)(=O)OP(O)(O)=O)n1ccc(=O)[nH]c1=O
: