Target
Fructose-bisphosphate aldolase A
Ligand
BDBM50320385
Substrate
Meas. Tech.
ChEMBL_634088 (CHEMBL1118360)
IC50
87000±n/a nM
Citation
 Ngantchou, INyasse, BDenier, CBlonski, CHannaert, VSchneider, B Antitrypanosomal alkaloids from Polyalthia suaveolens (Annonaceae): their effects on three selected glycolytic enzymes of Trypanosoma brucei. Bioorg Med Chem Lett 20:3495-8 (2010)  
Target
Name:
Fructose-bisphosphate aldolase A
Synonyms:
ALDOA | ALDOA_RABIT
Type:
PROTEIN
Mol. Mass.:
39351.00
Organism:
Oryctolagus cuniculus
Description:
ChEMBL_813854
Residue:
364
  
Inhibitor
Name:
BDBM50320385
Synonyms:
(4aR,6aR,12bS)-4,4,6a,12b-Tetramethyl-1,4a,5,6,6a,12,12a,12b-octahydro-2H,4H-6b-aza-benzo[5,6]pentaleno[2,1-b]naphthalen-3-one | CHEMBL1082691
Type:
Small organic molecule
Emp. Form.:
C23H29NO
Mol. Mass.:
335.4825
SMILES:
C[C@@]12CC[C@H]3C(C)(C)C(=O)CC[C@]3(C)C1Cc1cc3ccccc3n21
: