Target
Carbonic anhydrase 2
Ligand
BDBM50323751
Substrate
Meas. Tech.
ChEMBL_646954 (CHEMBL1217095)
Ki
64000±n/a nM
Citation
 Carta, FTemperini, CInnocenti, AScozzafava, AKaila, KSupuran, CT Polyamines inhibit carbonic anhydrases by anchoring to the zinc-coordinated water molecule. J Med Chem 53:5511-22 (2010)  
Target
Name:
Carbonic anhydrase 2
Synonyms:
CA-II CAC Carbonate dehydratase II Carbonic anhydrase 2 (CA-II) Carbonic anhydrase C Carbonic anhydrase II (CA-II) Carbonic anhydrase II (hCA II) | Carbonic anhydrase isoenzyme II (hCA II)
Type:
Enzyme
Mol. Mass.:
29250.71
Organism:
Homo sapiens (Human)
Description:
P00918
Residue:
260
  
Inhibitor
Name:
BDBM50323751
Synonyms:
CHEMBL609 N,N'-Bis-(2-amino-ethyl)-ethane-1,2-diamine TRIENTINE | triethylenetetramine
Type:
Small organic molecule
Emp. Form.:
C6H18N4
Mol. Mass.:
146.2339
SMILES:
NCCNCCNCCN
: