Target
Carbonic anhydrase 3
Ligand
BDBM50323751
Substrate
Meas. Tech.
ChEMBL_646955 (CHEMBL1217096)
Ki
48000±n/a nM
Citation
 Carta, FTemperini, CInnocenti, AScozzafava, AKaila, KSupuran, CT Polyamines inhibit carbonic anhydrases by anchoring to the zinc-coordinated water molecule. J Med Chem 53:5511-22 (2010)  
Target
Name:
Carbonic anhydrase 3
Synonyms:
CA-III CAH3_HUMAN Carbonic Anhydrase III Carbonic anhydrase 3 (CA III) | Carbonic anhydrase III (CA III)
Type:
Enzyme
Mol. Mass.:
29562.11
Organism:
Homo sapiens (Human)
Description:
Human cloned isozyme.
Residue:
260
  
Inhibitor
Name:
BDBM50323751
Synonyms:
CHEMBL609 N,N'-Bis-(2-amino-ethyl)-ethane-1,2-diamine TRIENTINE | triethylenetetramine
Type:
Small organic molecule
Emp. Form.:
C6H18N4
Mol. Mass.:
146.2339
SMILES:
NCCNCCNCCN
: