Target
cAMP-specific 3',5'-cyclic phosphodiesterase 4D
Ligand
BDBM50325786
Substrate
Meas. Tech.
ChEMBL_652843 (CHEMBL1226046)
IC50
0.600000±n/a nM
Citation
 Aspiotis, RDeschênes, DDubé, DGirard, YHuang, ZLaliberté, FLiu, SPapp, RNicholson, DWYoung, RN The discovery and synthesis of highly potent subtype selective phosphodiesterase 4D inhibitors. Bioorg Med Chem Lett 20:5502-5 (2010)  
Target
Name:
cAMP-specific 3',5'-cyclic phosphodiesterase 4D
Synonyms:
3',5'-cyclic phosphodiesterase PDE43 PDE4D_HUMAN | Phosphodiesterase 4D
Type:
Protein
Mol. Mass.:
91092.69
Organism:
Homo sapiens (Human)
Description:
Q08499
Residue:
809
  
Inhibitor
Name:
BDBM50325786
Synonyms:
4-(4-((8-(3-(difluoromethoxy)phenyl)quinolin-6-yl)methoxy)phenyl)-2-methylbutan-2-ol | CHEMBL1221434
Type:
Small organic molecule
Emp. Form.:
C28H27F2NO3
Mol. Mass.:
463.5157
SMILES:
CC(C)(O)CCc1ccc(OCc2cc(-c3cccc(OC(F)F)c3)c3ncccc3c2)cc1
: