Target
Alpha-1B adrenergic receptor
Ligand
BDBM50328503
Substrate
Meas. Tech.
ChEMBL_665657 (CHEMBL1261588)
Ki
0.9±n/a nM
Citation
 Kristensen, JLPüschl, AJensen, MRisgaard, RChristoffersen, CTBang-Andersen, BBalle, T Exploring the neuroleptic substituent in octoclothepin: potential ligands for positron emission tomography with subnanomolar affinity fora(1)-adrenoceptors. J Med Chem 53:7021-34 (2010)  
Target
Name:
Alpha-1B adrenergic receptor
Synonyms:
ADA1B_MESAU Adrenergic receptor alpha adrenergic Alpha1B
Type:
Enzyme Catalytic Domain
Mol. Mass.:
56514.13
Organism:
C.H.O.
Description:
adrenergic Alpha1B ADRA1B C.H.O.::P18841
Residue:
515
  
Inhibitor
Name:
BDBM50328503
Synonyms:
(R)-N-((11-(4-methylpiperazin-1-yl)-10,11-dihydrodibenzo[b,f]thiepin-2-yl)methyl)acetamide | CHEMBL1259173
Type:
Small organic molecule
Emp. Form.:
C22H27N3OS
Mol. Mass.:
381.534
SMILES:
CN1CCN(CC1)[C@@H]1Cc2ccccc2Sc2ccc(CNC(C)=O)cc12
: