Target
Protein arginine N-methyltransferase 1 [11-371]
Ligand
BDBM50210461
Substrate
Meas. Tech.
ChEMBL_675347 (CHEMBL1273384)
IC50
56600±n/a nM
Citation
 Feng, YLi, MWang, BZheng, YG Discovery and mechanistic study of a class of protein arginine methylation inhibitors. J Med Chem 53:6028-39 (2010)  
Target
Name:
Protein arginine N-methyltransferase 1 [11-371]
Synonyms:
ANM1_HUMAN HRMT1L2 PRMT1 Protein arginine methyltransferase 1 (PRMT1) | Protein-arginine N-methyltransferase 1
Type:
Protein
Mol. Mass.:
41506.52
Organism:
Homo sapiens (Human)
Description:
Q99873[11-371]
Residue:
361
  
Inhibitor
Name:
BDBM50210461
Synonyms:
(stilbamidine)4-[2-[4-amino(imino)methylphenyl]-(E)-1-ethenyl]phenyl-iminomethanamine 4-((E)-2-{4-[(Z)-amino(imino)methyl]phenyl}vinyl)benzenecarboximidamide CHEMBL142304 stilbamidine
Type:
Small organic molecule
Emp. Form.:
C16H16N4
Mol. Mass.:
264.325
SMILES:
NC(=N)c1ccc(\C=C\c2ccc(cc2)C(N)=N)cc1
: