Target
5-hydroxytryptamine receptor 6
Ligand
BDBM50330522
Substrate
Meas. Tech.
ChEMBL_684952 (CHEMBL1286367)
Ki
2.9±n/a nM
Citation
 Liu, KGRobichaud, AJBernotas, RCYan, YLo, JRZhang, MYHughes, ZAHuselton, CZhang, GMZhang, JYKowal, DMSmith, DLSchechter, LEComery, TA 5-Piperazinyl-3-sulfonylindazoles as potent and selective 5-hydroxytryptamine-6 antagonists. J Med Chem 53:7639-46 (2010)  
Target
Name:
5-hydroxytryptamine receptor 6
Synonyms:
5-HT-6 5-hydroxytryptamine receptor 6 (5-HT-6) 5-hydroxytryptamine receptor 6 (5HT6) HTR6 Serotonin 6 (5-HT6) receptor | Serotonin Receptor 6
Type:
G Protein-Coupled Receptor (GPCR)
Mol. Mass.:
46968.43
Organism:
Homo sapiens (Human)
Description:
P50406
Residue:
440
  
Inhibitor
Name:
BDBM50330522
Synonyms:
1-isopropyl-3-(naphthalen-1-ylsulfonyl)-5-(piperazin-1-yl)-1H-indazole | CHEMBL1277837
Type:
Small organic molecule
Emp. Form.:
C24H26N4O2S
Mol. Mass.:
434.554
SMILES:
CC(C)n1nc(c2cc(ccc12)N1CCNCC1)S(=O)(=O)c1cccc2ccccc12
: