Target
Serine/threonine-protein kinase Nek1
Ligand
BDBM50330575
Substrate
Meas. Tech.
ChEMBL_685027 (CHEMBL1286643)
Temperature
298.15±n/a K
IC50
170±n/a nM
Comments
extracted
Citation
 Whelligan, DKSolanki, STaylor, DThomson, DWCheung, KMBoxall, KMas-Droux, CBarillari, CBurns, SGrummitt, CGCollins, Ivan Montfort, RLAherne, GWBayliss, RHoelder, S Aminopyrazine inhibitors binding to an unusual inactive conformation of the mitotic kinase Nek2: SAR and structural characterization. J Med Chem 53:7682-98 (2010)  
Target
Name:
Serine/threonine-protein kinase Nek1
Synonyms:
KIAA1901 NEK1 Never in mitosis A-related kinase 1 Renal carcinoma antigen NY-REN-55
Type:
Protein
Mol. Mass.:
142810.07
Organism:
Homo sapiens (Human)
Description:
Residue:
1258
  
Inhibitor
Name:
BDBM50330575
Synonyms:
(-)-(2R,3R,4R)-1-(3-Amino-6-(3,4,5-trimethoxyphenyl)pyrazin-2-yl)-2,3-dimethylpiperidine-4-carboxylic Acid | CHEMBL1276848
Type:
Small organic molecule
Emp. Form.:
C21H28N4O5
Mol. Mass.:
416.4708
SMILES:
COc1cc(cc(OC)c1OC)-c1cnc(N)c(n1)N1CC[C@H]([C@@H](C)[C@H]1C)C(O)=O
: