Target
Zn finger protein
Ligand
BDBM50300203
Substrate
Meas. Tech.
ChEMBL_687568 (CHEMBL1290840)
Ki
48.6±n/a nM
Citation
 Maresca, AScozzafava, ASupuran, CT 7,8-disubstituted- but not 6,7-disubstituted coumarins selectively inhibit the transmembrane, tumor-associated carbonic anhydrase isoforms IX and XII over the cytosolic ones I and II in the low nanomolar/subnanomolar range. Bioorg Med Chem Lett 20:7255-8 (2010)  
Target
Name:
Zn finger protein
Synonyms:
Type:
PROTEIN
Mol. Mass.:
25827.13
Organism:
Nicotiana tabacum
Description:
ChEMBL_687568
Residue:
234
  
Inhibitor
Name:
BDBM50300203
Synonyms:
(S)-6-(1-hydroxy-3-methylbutyl)-7-methoxy-2H-chromen-2-one CHEMBL572366
Type:
Small organic molecule
Emp. Form.:
C15H18O4
Mol. Mass.:
262.301
SMILES:
COc1cc2oc(=O)ccc2cc1[C@@H](O)CC(C)C
: