Target
Acetyl-CoA carboxylase 2
Ligand
BDBM50332547
Substrate
Meas. Tech.
ChEMBL_695121 (CHEMBL1640869)
IC50
7800±n/a nM
Citation
 Keil, SMüller, MZoller, GHaschke, GSchroeter, KGlien, MRuf, SFocken, IHerling, AWSchmoll, D Identification and synthesis of novel inhibitors of acetyl-CoA carboxylase with in vitro and in vivo efficacy on fat oxidation. J Med Chem 53:8679-87 (2010)  
Target
Name:
Acetyl-CoA carboxylase 2
Synonyms:
ACACB ACC-beta ACCB Acetyl-CoA carboxylase 2 Acetyl-CoA carboxylase 2 (ACC2)
Type:
Protein
Mol. Mass.:
276535.21
Organism:
Homo sapiens (Human)
Description:
O00763
Residue:
2458
  
Inhibitor
Name:
BDBM50332547
Synonyms:
(R)-N-(4-(4-(6-isopropoxypyridin-3-yloxy)phenyl)butan-2-yl)acetamide | CHEMBL1630716
Type:
Small organic molecule
Emp. Form.:
C20H26N2O3
Mol. Mass.:
342.432
SMILES:
CC(C)Oc1ccc(Oc2ccc(CC[C@@H](C)NC(C)=O)cc2)cn1
: