Target
5-hydroxytryptamine receptor 1A
Ligand
BDBM50333450
Substrate
Meas. Tech.
ChEMBL_698908 (CHEMBL1645848)
Ki
1±n/a nM
Citation
 Pettersson, MCampbell, BMDounay, ABGray, DLXie, LO'Donnell, CJStratman, NCZoski, KDrummond, EBora, GProbert, AWhisman, T Design, synthesis, and pharmacological evaluation of azetedine and pyrrolidine derivatives as dual norepinephrine reuptake inhibitors and 5-HT(1A) partial agonists. Bioorg Med Chem Lett 21:865-8 (2011)  
Target
Name:
5-hydroxytryptamine receptor 1A
Synonyms:
5-HT-1A 5-hydroxytryptamine receptor 1A (5-HT-1A) ADRB2RL1 Dopamine D2 receptor and serotonin 1a receptor HTR1A | Serotonin receptor 1A
Type:
Mol. Mass.:
46122.49
Organism:
Homo sapiens (Human)
Description:
Residue:
422
  
Inhibitor
Name:
BDBM50333450
Synonyms:
(R)-3-(2-(2-chloro-6-fluorophenoxy)-6-fluorophenoxy)pyrrolidine | CHEMBL1645617
Type:
Small organic molecule
Emp. Form.:
C16H14ClF2NO2
Mol. Mass.:
325.738
SMILES:
Fc1cccc(Oc2c(F)cccc2Cl)c1O[C@@H]1CCNC1
: