Target
Prostaglandin E2 receptor EP4 subtype
Ligand
BDBM50333737
Substrate
Meas. Tech.
ChEMBL_700671 (CHEMBL1645710)
Ki
0.200000±n/a nM
Citation
 Li, LMathieu, MCDenis, DTherien, AGWang, Z The identification of substituted benzothiophene derivatives as PGE(2) subtype 4 receptor antagonists: From acid to non-acid. Bioorg Med Chem Lett 21:734-7 (2011)  
Target
Name:
Prostaglandin E2 receptor EP4 subtype
Synonyms:
PE2R4_HUMAN PGE2 receptor EP4 subtype PTGER4 Prostanoid EP4 receptor
Type:
Enzyme
Mol. Mass.:
53134.53
Organism:
Homo sapiens (Human)
Description:
P35408
Residue:
488
  
Inhibitor
Name:
BDBM50333737
Synonyms:
3-(4-(2-(2-(2-methoxyphenyl)acetamido)ethyl)phenyl)-N,N,5,7-tetramethylbenzo[b]thiophene-2-carboxamide | CHEMBL1644016
Type:
Small organic molecule
Emp. Form.:
C30H32N2O3S
Mol. Mass.:
500.652
SMILES:
COc1ccccc1CC(=O)NCCc1ccc(cc1)-c1c(sc2c(C)cc(C)cc12)C(=O)N(C)C
: