Target
Sodium- and chloride-dependent GABA transporter 1
Ligand
BDBM50039251
Substrate
Meas. Tech.
ChEMBL_699418 (CHEMBL1647445)
Ki
16.98±n/a nM
Citation
 Pizzi, DALeslie, CPDi Fabio, RSeri, CBernasconi, GSquaglia, MCarnevale, GFalchi, AGreco, EMangiarini, LNegri, M Stereospecific synthesis and structure-activity relationships of unsymmetrical 4,4-diphenylbut-3-enyl derivatives of nipecotic acid as GAT-1 inhibitors. Bioorg Med Chem Lett 21:602-5 (2010)  
Target
Name:
Sodium- and chloride-dependent GABA transporter 1
Synonyms:
GABA transporter 1 GABT1 GAT1 SLC6A1 Solute carrier family 6 member 1
Type:
PROTEIN
Mol. Mass.:
67079.40
Organism:
Homo sapiens (Human)
Description:
ChEMBL_1454196
Residue:
599
  
Inhibitor
Name:
BDBM50039251
Synonyms:
(R)-1-(4,4-bis(3-methylthiophen-2-yl)but-3-enyl)piperidine-3-carboxylic acid hydrochloride (R)-1-[4,4-Bis-(3-methyl-thiophen-2-yl)-but-3-enyl]-piperidine-3-carboxylic acid; hydrochloride 1-[4,4-Bis-(3-methyl-4,5-dihydro-thiophen-2-yl)-but-3-enyl]-piperidine-3-carboxylic acid A-70569-1 ABBOTT-70569-1 CHEMBL1027 NNC-05-0328 TIAGABINE | Tiagabine hydrochloride
Type:
Small organic molecule
Emp. Form.:
C20H25NO2S2
Mol. Mass.:
375.548
SMILES:
[#6]-c1ccsc1\[#6](=[#6]/[#6]-[#6]-[#7]-1-[#6]-[#6]-[#6]-[#6@H](-[#6]-1)-[#6](-[#8])=O)-c1sccc1-[#6]
: