Target
Beta-lactamase
Ligand
BDBM50021959
Substrate
Meas. Tech.
ChEMBL_703758 (CHEMBL1657726)
IC50
1462480±n/a nM
Citation
 Beceiro, APérez, AFernández-Cuenca, FMartínez-Martínez, LPascual, AVila, JRodríguez-Baño, JCisneros, JMPachón, JBou, G Genetic variability among ampC genes from acinetobacter genomic species 3. Antimicrob Agents Chemother 53:1177-84 (2009)  
Target
Name:
Beta-lactamase
Synonyms:
ADC-16 protein
Type:
PROTEIN
Mol. Mass.:
43150.78
Organism:
Acinetobacter genomosp. 3
Description:
ChEMBL_703758
Residue:
383
  
Inhibitor
Name:
BDBM50021959
Synonyms:
CHEMBL777 US9120808, Clavulanic acid potassium salt clavulanic acid
Type:
Small organic molecule
Emp. Form.:
C8H9NO5
Mol. Mass.:
199.1608
SMILES:
OC\C=C1/O[C@@H]2CC(=O)N2[C@H]1C(O)=O
: